BDBM50057851 (5aS,11bR)-2-Phenyl-4,5,5a,6,7,11b-hexahydro-3-thia-5-aza-cyclopenta[c]phenanthrene-9,10-diol::CHEMBL43514
SMILES Oc1cc2CC[C@@H]3NCc4sc(cc4[C@H]3c2cc1O)-c1ccccc1
InChI Key InChIKey=KMEFMCVBQGTUCT-HRAATJIYSA-N
Data  2 KI  1 EC50
  Tab Delimited (TSV)   2D SDfile   Computed 3D by Vconf -m prep SDfile
Find this compound or compounds like it in BindingDB:
Activity Spreadsheet -- Enzyme Inhibition Constant Data from BindingDB
Found 3 hits for monomerid = 50057851
TargetD(1A) dopamine receptor(RAT)
Abbott Laboratories
Curated by ChEMBL
LigandPNGBDBM50057851((5aS,11bR)-2-Phenyl-4,5,5a,6,7,11b-hexahydro-3-thi...)
Affinity DataKi:  1.13E+3nM. Assay description: In vitro binding affinity against Dopamine receptor D1 like from rat caudate membrane using [125I]-SCH as radioligand
In DepthDetails ArticlePubMed
TargetD(2) dopamine receptor(Rattus norvegicus (rat))
Abbott Laboratories
Curated by ChEMBL
LigandPNGBDBM50057851((5aS,11bR)-2-Phenyl-4,5,5a,6,7,11b-hexahydro-3-thi...)
Affinity DataKi:  2.59E+3nM. Assay description: In vitro binding affinity against Dopamine receptor D2 like from rat caudate membrane using [3H]-spiperone as radioligand
In DepthDetails ArticlePubMed
TargetD(1) dopamine receptor(Carassius auratus)
Abbott Laboratories
Curated by ChEMBL
LigandPNGBDBM50057851((5aS,11bR)-2-Phenyl-4,5,5a,6,7,11b-hexahydro-3-thi...)
Affinity DataEC50:  80nM. Assay description: Ability to stimulate the Dopamine receptor D1 like was assayed by measuring cAMP production in cell free homogenates of goldfish retinal tissue
In DepthDetails ArticlePubMed