BDBM50067414 2'-(4-trifluoromethylbenzyl)spiro[tetrahydro-1H-pyrrole-3,4'-(1',2',3',4'-tetrahydropyrrolo[1,2-a]pyrazine)]-1',2,3',5-tetraone::CHEMBL130516
SMILES FC(F)(F)c1ccc(CN2C(=O)c3cccn3C3(CC(=O)NC3=O)C2=O)cc1
InChI Key InChIKey=ZPRMXUBHWPVFPA-UHFFFAOYSA-N
Data  1 IC50
  Tab Delimited (TSV)   2D SDfile   Computed 3D by Vconf -m prep SDfile
Find this compound or compounds like it in BindingDB:
Activity Spreadsheet -- Enzyme Inhibition Constant Data from BindingDB
Found 1 hit for monomerid = 50067414
TargetAldo-keto reductase family 1 member B1(Sus scrofa)
Dainippon Pharmaceutical
Curated by ChEMBL
LigandPNGBDBM50067414(2'-(4-trifluoromethylbenzyl)spiro[tetrahydro-1H-py...)
Affinity DataIC50:  80nM. Assay description: In vitro inhibitory activity against aldose reductase in porcine lens.
In DepthDetails ArticlePubMed