BDBM50069095 CHEMBL3403516::US10189853, Compound 9
SMILES COc1ccc2n(ccc2c1)-c1nc(C)nc2oc(C)cc12
InChI Key InChIKey=UDKMOAHOTPOVJU-UHFFFAOYSA-N
Data  6 IC50
  Tab Delimited (TSV)   2D SDfile   Computed 3D by Vconf -m prep SDfile
Find this compound or compounds like it in BindingDB:
Activity Spreadsheet -- Enzyme Inhibition Constant Data from BindingDB
Found 6 hits for monomerid = 50069095
TargetEpidermal growth factor receptor(Homo sapiens (Human))
Duquesne University
Curated by ChEMBL
LigandPNGBDBM50069095(CHEMBL3403516 | US10189853, Compound 9)
Affinity DataIC50: >500nM. Assay description: Inhibition of EGFR in human A431 cells compound pretreated for 60 min before EGF stimulation for 10 mins by phosphotyrosine ELISA cytoblot method
In DepthDetails ArticlePubMed
TargetVascular endothelial growth factor receptor 2(Homo sapiens (Human))
Duquesne University
Curated by ChEMBL
LigandPNGBDBM50069095(CHEMBL3403516 | US10189853, Compound 9)
Affinity DataIC50: >300nM. Assay description: Inhibition of VEGFR2 in human U251 cells compound pretreated for 60 min before VEGF stimulation for 10 mins by phosphotyrosine ELISA cytoblot method
In DepthDetails ArticlePubMed
TargetPlatelet-derived growth factor receptor alpha(Homo sapiens (Human))
Duquesne University of The Holy Spirit
US Patent
LigandPNGBDBM50069095(CHEMBL3403516 | US10189853, Compound 9)
Affinity DataIC50:  198nM. Assay description: RTK inhibitory activity of the compounds 2-12 were evaluated using human tumor cells known to express high levels of EGFR, VEGFR-2 or PDFGR-β us...
In DepthDetails US Patent
TargetEpidermal growth factor receptor(Homo sapiens (Human))
Duquesne University
Curated by ChEMBL
LigandPNGBDBM50069095(CHEMBL3403516 | US10189853, Compound 9)
Affinity DataIC50: >500nM. Assay description: RTK inhibitory activity of the compounds 2-12 were evaluated using human tumor cells known to express high levels of EGFR, VEGFR-2 or PDFGR-β us...
In DepthDetails US Patent
TargetVascular endothelial growth factor receptor 2(Homo sapiens (Human))
Duquesne University
Curated by ChEMBL
LigandPNGBDBM50069095(CHEMBL3403516 | US10189853, Compound 9)
Affinity DataIC50: >300nM. Assay description: RTK inhibitory activity of the compounds 2-12 were evaluated using human tumor cells known to express high levels of EGFR, VEGFR-2 or PDFGR-β us...
In DepthDetails US Patent
TargetPlatelet-derived growth factor receptor beta(Homo sapiens (Human))
Duquesne University
Curated by ChEMBL
LigandPNGBDBM50069095(CHEMBL3403516 | US10189853, Compound 9)
Affinity DataIC50:  198nM. Assay description: Inhibition of PDGFR-beta in human U251 cells compound pretreated for 60 min before PDGF-BB stimulation for 10 mins by phosphotyrosine ELISA cytoblot ...
In DepthDetails ArticlePubMed