BDBM50069463 CHEMBL149492::N-(7-Bromo-2,3-dioxo-1,2,3,4-tetrahydro-quinoxalin-5-ylmethyl)-3-phenyl-propionamide
SMILES Brc1cc(CNC(=O)CCc2ccccc2)c2[nH]c(=O)c(=O)[nH]c2c1
InChI Key InChIKey=PCARITKDGLENBQ-UHFFFAOYSA-N
Data  1 IC50
  Tab Delimited (TSV)   2D SDfile   Computed 3D by Vconf -m prep SDfile
Find this compound or compounds like it in BindingDB:
Activity Spreadsheet -- Enzyme Inhibition Constant Data from BindingDB
Found 1 hit for monomerid = 50069463
TargetGlutamate receptor ionotropic, NMDA 1(RAT)
Novartis Pharma
Curated by ChEMBL
LigandPNGBDBM50069463(CHEMBL149492 | N-(7-Bromo-2,3-dioxo-1,2,3,4-tetrah...)
Affinity DataIC50:  860nM. Assay description: In vitro binding assay for the displacement of [3H]MDL-105519 from the glycine-site of NMDA receptors
In DepthDetails ArticlePubMed