BDBM50070559 CHEMBL3408800
SMILES Nc1ncnc2c3cc(cnc3sc12)-c1ccc(cc1)C(F)(F)F
InChI Key InChIKey=DWLIDYVUXMDVQO-UHFFFAOYSA-N
Data  2 IC50
  Tab Delimited (TSV)   2D SDfile   Computed 3D by Vconf -m prep SDfile
Find this compound or compounds like it in BindingDB:
Activity Spreadsheet -- Enzyme Inhibition Constant Data from BindingDB
Found 2 hits for monomerid = 50070559
TargetDual specificity protein kinase CLK1(Homo sapiens (Human))
Cobra
Curated by ChEMBL
LigandPNGBDBM50070559(CHEMBL3408800)
Affinity DataIC50:  1.70E+3nM. Assay description: Inhibition of human recombinant GST-tagged CLK1 expressed in Escherichia coli using GRSRSRSRSRSR as substrate after 30 mins
In DepthDetails ArticlePubMed
LigandPNGBDBM50070559(CHEMBL3408800)
Affinity DataIC50:  6.80E+3nM. Assay description: Inhibition of rat recombinant GST-tagged DYRK1A expressed in Escherichia coli using KKISGRLSPIMTEQ as substrate after 30 mins by scintillation counti...
In DepthDetails ArticlePubMed