BDBM50072276 CHEMBL3408340
SMILES CCCn1c2ccc(cc2n(CCC)c1=O)C(=O)c1c(C)nn(C)c1O
InChI Key InChIKey=MMLKVJNYFIKYOO-UHFFFAOYSA-N
Data  1 IC50
  Tab Delimited (TSV)   2D SDfile   Computed 3D by Vconf -m prep SDfile
Find this compound or compounds like it in BindingDB:
Activity Spreadsheet -- Enzyme Inhibition Constant Data from BindingDB
Found 1 hit for monomerid = 50072276
Target4-hydroxyphenylpyruvate dioxygenase(Homo sapiens (Human))
Central China Normal University
Curated by ChEMBL
LigandPNGBDBM50072276(CHEMBL3408340)
Affinity DataIC50:  720nM. Assay description: Inhibition of human recombinant His-tagged HPPD expressed in Escherichia coli BL21(DE3) by UV/visible plate reader analysis
In DepthDetails ArticlePubMed