BDBM50073881 4-Ethoxy-1-mercaptomethyl-cyclohexanecarboxylic acid [(S)-2-(4-methoxy-phenyl)-1-phenylcarbamoyl-ethyl]-amide::CHEMBL291542
SMILES CCO[C@H]1CC[C@](CS)(CC1)C(=O)N[C@@H](Cc1ccc(OC)cc1)C(=O)Nc1ccccc1
InChI Key InChIKey=PERUGQATUXFFFE-JCYRPKCISA-N
Data  3 IC50
  Tab Delimited (TSV)   2D SDfile   Computed 3D by Vconf -m prep SDfile
Find this compound or compounds like it in BindingDB:
Activity Spreadsheet -- Enzyme Inhibition Constant Data from BindingDB
Found 3 hits for monomerid = 50073881
TargetMetalloproteinase inhibitor 3(Rattus norvegicus)
Novartis Biomedical Research Institute
Curated by ChEMBL
LigandPNGBDBM50073881(4-Ethoxy-1-mercaptomethyl-cyclohexanecarboxylic ac...)
Affinity DataIC50:  62nM. Assay description: In vitro inhibitory activity against matrix metalloproteinase-3
In DepthDetails ArticlePubMed
TargetMatrix metalloproteinase-9(Rattus norvegicus (Rat))
Novartis Biomedical Research Institute
Curated by ChEMBL
LigandPNGBDBM50073881(4-Ethoxy-1-mercaptomethyl-cyclohexanecarboxylic ac...)
Affinity DataIC50:  20nM. Assay description: In vitro inhibitory activity against matrix metalloproteinase-9
In DepthDetails ArticlePubMed
TargetInterstitial collagenase(Homo sapiens (Human))
Novartis Biomedical Research Institute
Curated by ChEMBL
LigandPNGBDBM50073881(4-Ethoxy-1-mercaptomethyl-cyclohexanecarboxylic ac...)
Affinity DataIC50:  1.06E+3nM. Assay description: Inhibition of matrix metalloproteinase 1 (MMP 1)
In DepthDetails ArticlePubMed