BDBM50074662 (S)-2-((S)-2-{(S)-2-[(S)-2-Amino-3-(4-hydroxy-phenyl)-propionylamino]-4-methyl-pentanoylamino}-3-carboxy-propionylamino)-3-methyl-butyric acid::CHEMBL173870
SMILES CC(C)C[C@H](NC(=O)[C@@H](N)Cc1ccc(O)cc1)C(=O)N[C@@H](CC(O)=O)C(=O)N[C@@H](C(C)C)C(O)=O
InChI Key InChIKey=PYLZUSNEVWOCOT-JPLJXNOCSA-N
Data  2 IC50
  Tab Delimited (TSV)   2D SDfile   Computed 3D by Vconf -m prep SDfile
Find this compound or compounds like it in BindingDB:
Activity Spreadsheet -- Enzyme Inhibition Constant Data from BindingDB
Found 2 hits for monomerid = 50074662
TargetIntegrin alpha-4/beta-1(Homo sapiens (Human))
Biogen
Curated by ChEMBL
LigandPNGBDBM50074662((S)-2-((S)-2-{(S)-2-[(S)-2-Amino-3-(4-hydroxy-phen...)
Affinity DataIC50:  5.10E+4nM. Assay description: Inhibition of integrin alpha4-beta1 adhesion to Jurkat cells
In DepthDetails ArticlePubMed
TargetIntegrin alpha-4/beta-1(Homo sapiens (Human))
Biogen
Curated by ChEMBL
LigandPNGBDBM50074662((S)-2-((S)-2-{(S)-2-[(S)-2-Amino-3-(4-hydroxy-phen...)
Affinity DataIC50:  1.26E+4nM. Assay description: Inhibition of integrin alpha4-beta1 binding to VCAM-Ig
In DepthDetails ArticlePubMed