BDBM50074663 CHEMBL3410094
SMILES O=C(Nc1cc(ccn1)-c1ccc2C(=O)NCCc2c1)C1CC1
InChI Key InChIKey=ZGDKLIRAIPCTLW-UHFFFAOYSA-N
Data  1 IC50
  Tab Delimited (TSV)   2D SDfile   Computed 3D by Vconf -m prep SDfile
Find this compound or compounds like it in BindingDB:
Activity Spreadsheet -- Enzyme Inhibition Constant Data from BindingDB
Found 1 hit for monomerid = 50074663
TargetGlycogen synthase kinase-3 beta(Homo sapiens (Human))
Bristol-Myers Squibb Research And Development
Curated by ChEMBL
LigandPNGBDBM50074663(CHEMBL3410094)
Affinity DataIC50:  2.40nM. Assay description: Inhibition of GSK3beta (unknown origin) activity by competitive binding assay
In DepthDetails ArticlePubMed