BDBM50076339 (S)-3-(4-Hydroxy-phenyl)-N-methyl-2-[3-(5-thioxo-4,5-dihydro-[1,3,4]thiadiazol-2-yl)-ureido]-propionamide::CHEMBL37147
SMILES CNC(=O)[C@H](Cc1ccc(O)cc1)NC(=O)Nc1nnc(S)s1
InChI Key InChIKey=NVYQUIXKTUPQLY-VIFPVBQESA-N
Data  2 KI
  Tab Delimited (TSV)   2D SDfile   Computed 3D by Vconf -m prep SDfile
Find this compound or compounds like it in BindingDB:
Activity Spreadsheet -- Enzyme Inhibition Constant Data from BindingDB
Found 2 hits for monomerid = 50076339
TargetStromelysin-1(Homo sapiens (Human))
Pharmacia And Upjohn
Curated by ChEMBL
LigandPNGBDBM50076339((S)-3-(4-Hydroxy-phenyl)-N-methyl-2-[3-(5-thioxo-4...)
Affinity DataKi:  400nM. Assay description: Binding affinity for matrix metalloproteinase-3
In DepthDetails ArticlePubMed
TargetInterstitial collagenase(Homo sapiens (Human))
Pharmacia And Upjohn
Curated by ChEMBL
LigandPNGBDBM50076339((S)-3-(4-Hydroxy-phenyl)-N-methyl-2-[3-(5-thioxo-4...)
Affinity DataKi:  2.10E+4nM. Assay description: Binding affinity for matrix metalloproteinase-1
In DepthDetails ArticlePubMed