BDBM50077106 CHEMBL3416702
SMILES COC(=O)c1ccc(NC(=O)[C@@H](N)CCCNC(N)=N)c(N)c1
InChI Key InChIKey=ZPJSMONGVMASNL-VIFPVBQESA-N
Data  2 IC50
  Tab Delimited (TSV)   2D SDfile   Computed 3D by Vconf -m prep SDfile
Find this compound or compounds like it in BindingDB:
Activity Spreadsheet -- Enzyme Inhibition Constant Data from BindingDB
Found 2 hits for monomerid = 50077106
TargetEndoplasmic reticulum aminopeptidase 2(Homo sapiens (Human))
National Center For Scientific Research&Quot;Demokritos&Quot
Curated by ChEMBL
LigandPNGBDBM50077106(CHEMBL3416702)
Affinity DataIC50:  2.50E+3nM. Assay description: Inhibition of human recombinant ERAP2 expressed in baculovirus infected cabbage looper ovary Hi5 cells using L-arginyl-7-amido-4-methyl coumarin as s...
In DepthDetails ArticlePubMed
TargetLeucyl-cystinyl aminopeptidase(Homo sapiens (Human))
National Center For Scientific Research&Quot;Demokritos&Quot
Curated by ChEMBL
LigandPNGBDBM50077106(CHEMBL3416702)
Affinity DataIC50:  3.96E+4nM. Assay description: Inhibition of human recombinant IRAP expressed in baculovirus infected cabbage looper ovary Hi5 cells using L-leucine-7-amido-4-methyl coumarin as su...
In DepthDetails ArticlePubMed