BDBM50083069 6-(3-Methyl-isoxazol-5-ylmethylene)-1-aza-bicyclo[3.2.1]octane::6-[1-(3-Methyl-isoxazol-5-yl)-meth-(Z)-ylidene]-1-aza-bicyclo[3.2.1]octane::CHEMBL60656
SMILES Cc1cc(\C=C2/CN3CC2CCC3)on1
InChI Key InChIKey=ARZOYSBDVRQNMW-IZZDOVSWSA-N
Data  3 IC50
  Tab Delimited (TSV)   2D SDfile   Computed 3D by Vconf -m prep SDfile
Find this compound or compounds like it in BindingDB:
Activity Spreadsheet -- Enzyme Inhibition Constant Data from BindingDB
Found 3 hits for monomerid = 50083069
TargetNeuronal acetylcholine receptor subunit alpha-3/beta-2(Homo sapiens (Human))
TBA
Curated by ChEMBL
LigandPNGBDBM50083069(6-(3-Methyl-isoxazol-5-ylmethylene)-1-aza-bicyclo[...)
Affinity DataIC50:  217nM. Assay description: Inhibitory concentration required for in vitro binding affinity to Nicotinic acetylcholine receptor alpha3-beta2 expressed on cell line sf 9 by using...
In DepthDetails Article
LigandPNGBDBM50083069(6-(3-Methyl-isoxazol-5-ylmethylene)-1-aza-bicyclo[...)
Affinity DataIC50:  898nM. Assay description: In vitro displacement of [3H]oxotremorine-M from muscarinic acetylcholine receptor in rat brain cortex
In DepthDetails ArticlePubMed
LigandPNGBDBM50083069(6-(3-Methyl-isoxazol-5-ylmethylene)-1-aza-bicyclo[...)
Affinity DataIC50:  950nM. Assay description: Inhibitory concentration required for in vitro binding affinity to cholinergic central muscarinic receptor on rat brain cortex by using [3H]OXO-M
In DepthDetails Article