BDBM50086072 5-Methoxy-6-trifluoromethyl-2,3-dihydro-indole-1-carboxylic acid (4-methyl-3-pyridin-3-yl-phenyl)-amide::CHEMBL14606
SMILES COc1cc2CCN(C(=O)Nc3ccc(C)c(c3)-c3cccnc3)c2cc1C(F)(F)F
InChI Key InChIKey=PZNJOBNPOKNKKD-UHFFFAOYSA-N
Data  3 KI  1 IC50
  Tab Delimited (TSV)   2D SDfile   Computed 3D by Vconf -m prep SDfile
Find this compound or compounds like it in BindingDB:
Activity Spreadsheet -- Enzyme Inhibition Constant Data from BindingDB
Found 4 hits for monomerid = 50086072
Target5-hydroxytryptamine receptor 2C(Homo sapiens (Human))
Smithkline Beecham Pharmaceuticals
Curated by ChEMBL
LigandPNGBDBM50086072(5-Methoxy-6-trifluoromethyl-2,3-dihydro-indole-1-c...)
Affinity DataKi:  1nM. Assay description: Binding affinity towards human cloned 5-hydroxytryptamine receptor 2C in HEK293 cells, using [3H]mesulergine as radioligand.Checked by Author
In DepthDetails ArticlePubMed
Target5-hydroxytryptamine receptor 2B(Homo sapiens (Human))
Smithkline Beecham Pharmaceuticals
Curated by ChEMBL
LigandPNGBDBM50086072(5-Methoxy-6-trifluoromethyl-2,3-dihydro-indole-1-c...)
Affinity DataKi:  5nM. Assay description: Binding affinities towards human cloned 5-hydroxytryptamine 2B receptor in HEK293 cells using [3H]5-HT as radioligand.Checked by Author
In DepthDetails ArticlePubMed
Target5-hydroxytryptamine receptor 2A(Homo sapiens (Human))
Smithkline Beecham Pharmaceuticals
Curated by ChEMBL
LigandPNGBDBM50086072(5-Methoxy-6-trifluoromethyl-2,3-dihydro-indole-1-c...)
Affinity DataKi:  5.01E+3nM. Assay description: Binding affinity towards human cloned 5-hydroxytryptamine receptor 2A in HEK293 cells, using [3H]ketanserin as radioligand.Checked by Author
In DepthDetails ArticlePubMed
TargetCytochrome P450 1A2(Homo sapiens (Human))
Smithkline Beecham Pharmaceuticals
Curated by ChEMBL
LigandPNGBDBM50086072(5-Methoxy-6-trifluoromethyl-2,3-dihydro-indole-1-c...)
Affinity DataIC50:  7.00E+3nM. Assay description: Inhibition of heterologously expressed human cytochrome P450 1A2.Checked by Author
In DepthDetails ArticlePubMed