BDBM50087018 3-Allyl-8-(5,8-dichloro-1,2,3,4-tetrahydro-naphthalen-2-yl)-1-phenyl-1,3,8-triaza-spiro[4.5]decan-4-one::CHEMBL283265
SMILES Clc1ccc(Cl)c2CC(CCc12)N1CCC2(CC1)N(CN(CC=C)C2=O)c1ccccc1
InChI Key InChIKey=CAHRJFAYDOYKDX-UHFFFAOYSA-N
Data  3 KI
  Tab Delimited (TSV)   2D SDfile   Computed 3D by Vconf -m prep SDfile
Find this compound or compounds like it in BindingDB:
Activity Spreadsheet -- Enzyme Inhibition Constant Data from BindingDB
Found 3 hits for monomerid = 50087018
TargetMu-type opioid receptor(Homo sapiens (Human))
F. Hoffmann-La Roche
Curated by ChEMBL
LigandPNGBDBM50087018(3-Allyl-8-(5,8-dichloro-1,2,3,4-tetrahydro-naphtha...)
Affinity DataKi:  5.90nM. Assay description: Competitive binding displacement analyses was performed from permanently transfected HEK293 cells expressing human Opioid receptor mu 1
In DepthDetails ArticlePubMed
TargetNociceptin receptor(Homo sapiens (Human))
F. Hoffmann-La Roche
Curated by ChEMBL
LigandPNGBDBM50087018(3-Allyl-8-(5,8-dichloro-1,2,3,4-tetrahydro-naphtha...)
Affinity DataKi:  6.80nM. Assay description: Effective concentration required to stimulate binding of GTPgammaS to Opioid receptor like 1 was determined using scintillation proximity assay
In DepthDetails ArticlePubMed
TargetKappa-type opioid receptor(Homo sapiens (Human))
F. Hoffmann-La Roche
Curated by ChEMBL
LigandPNGBDBM50087018(3-Allyl-8-(5,8-dichloro-1,2,3,4-tetrahydro-naphtha...)
Affinity DataKi:  26nM. Assay description: Competitive binding displacement analyses was performed from permanently transfected HEK293 cells expressing Opioid receptor kappa 1
In DepthDetails ArticlePubMed