BDBM50090366 3-(4-Methoxy-benzenesulfonyl)-nonanoic acid hydroxyamide::CHEMBL44045
SMILES CCCCCCC(CC(=O)NO)S(=O)(=O)c1ccc(OC)cc1
InChI Key InChIKey=XNBVIEGDQYIRRA-UHFFFAOYSA-N
Data  3 KI
  Tab Delimited (TSV)   2D SDfile   Computed 3D by Vconf -m prep SDfile
Find this compound or compounds like it in BindingDB:
Activity Spreadsheet -- Enzyme Inhibition Constant Data from BindingDB
Found 3 hits for monomerid = 50090366
Target72 kDa type IV collagenase(Homo sapiens (Human))
Rhone-Poulenc Rorer
Curated by ChEMBL
LigandPNGBDBM50090366(3-(4-Methoxy-benzenesulfonyl)-nonanoic acid hydrox...)
Affinity DataKi:  31nM. Assay description: In vitro inhibition of human recombinant Matrix metalloproteinase-2.
In DepthDetails ArticlePubMed
TargetStromelysin-1(Homo sapiens (Human))
Rhone-Poulenc Rorer
Curated by ChEMBL
LigandPNGBDBM50090366(3-(4-Methoxy-benzenesulfonyl)-nonanoic acid hydrox...)
Affinity DataKi:  734nM. Assay description: In vitro inhibition of human recombinant Matrix metalloproteinase-3.
In DepthDetails ArticlePubMed
TargetInterstitial collagenase(Homo sapiens (Human))
Rhone-Poulenc Rorer
Curated by ChEMBL
LigandPNGBDBM50090366(3-(4-Methoxy-benzenesulfonyl)-nonanoic acid hydrox...)
Affinity DataKi:  9.59E+3nM. Assay description: In vitro inhibition of human recombinant Matrix metalloproteinase-1.
In DepthDetails ArticlePubMed