BDBM50092000 1-Hydroxy-naphthalene-2-carboxylic acid 4-nitro-benzylamide::CHEMBL292344
SMILES Oc1c(ccc2ccccc12)C(=O)NCc1ccc(cc1)[N+]([O-])=O
InChI Key InChIKey=GXQSALKDCSGKSP-UHFFFAOYSA-N
Data  1 IC50
  Tab Delimited (TSV)   2D SDfile   Computed 3D by Vconf -m prep SDfile
Find this compound or compounds like it in BindingDB:
Activity Spreadsheet -- Enzyme Inhibition Constant Data from BindingDB
Found 1 hit for monomerid = 50092000
TargetDNA polymerase catalytic subunit(Human herpesvirus 6A (strain Uganda-1102) (HHV-6 v...)
Pharmacia
Curated by ChEMBL
LigandPNGBDBM50092000(1-Hydroxy-naphthalene-2-carboxylic acid 4-nitro-be...)
Affinity DataIC50:  1.45E+4nM. Assay description: Inhibitory activity against Human Cytomegalovirus (HCMV) polymerase
In DepthDetails ArticlePubMed