BDBM50095922 CHEMBL3590373
SMILES [H][C@]12CCCCN1C(=O)[C@]([H])(NC(=O)[C@H](Cc1ccc(F)cc1)NC(=O)[C@@H](Cc1ccccc1)NC(=O)c1cc3cc(c1)C(=O)NC[C@]([H])(NC(=O)[C@@H](Cc1ccccc1)NC(=O)[C@H](C)NC(=O)[C@H](CCCNC(N)=N)NC(=O)[C@H](Cc1ccc4ccccc4c1)NC2=O)C(=O)N[C@@H](CCCNC(N)=N)C(=O)N[C@@H](CCCNC(N)=N)C(=O)N[C@@H](Cc1ccc2ccccc2c1)C(=O)N[C@@H](Cc1ccccc1)C(=O)N[C@@H](CCCNC(N)=N)C(=O)N[C@@H](CCCNC(N)=N)C(=O)N[C@@H](CNC3=O)C(=O)N[C@@H](CCCCN)C(O)=O)[C@H](C)O
InChI Key InChIKey=ZPQXPWPLGNNODE-SPVKZBCVSA-N
Data  1 Kd
  Tab Delimited (TSV)   2D SDfile   Computed 3D by Vconf -m prep SDfile
Find this compound or compounds like it in BindingDB:
Activity Spreadsheet -- Enzyme Inhibition Constant Data from BindingDB
Found 1 hit for monomerid = 50095922
TargetPeptidyl-prolyl cis-trans isomerase NIMA-interacting 1(Homo sapiens (Human))
The Ohio State University
Curated by ChEMBL
LigandPNGBDBM50095922(CHEMBL3590373)
Affinity DataKd:  1.38E+3nM. Assay description: Binding affinity to N-terminal MBP fused and Texas-red-labeled full-length human Pin1 S16A/Y23A mutant expressed in Escherichia coli assessed as incr...
In DepthDetails ArticlePubMed