BDBM50099474 4-[5-(8-Isopropyl-4-phenyl-quinolin-2-yl)-1H-pyrrol-2-yl]-benzoic acid::CHEMBL20066
SMILES CC(C)c1cccc2c(cc(nc12)-c1ccc([nH]1)-c1ccc(cc1)C(O)=O)-c1ccccc1
InChI Key InChIKey=LSGNKLDHMQVTEK-UHFFFAOYSA-N
Data  3 IC50
  Tab Delimited (TSV)   2D SDfile   Computed 3D by Vconf -m prep SDfile
Find this compound or compounds like it in BindingDB:
Activity Spreadsheet -- Enzyme Inhibition Constant Data from BindingDB
Found 3 hits for monomerid = 50099474
TargetRetinoic acid receptor alpha(Homo sapiens (Human))
Eisai
Curated by ChEMBL
LigandPNGBDBM50099474(4-[5-(8-Isopropyl-4-phenyl-quinolin-2-yl)-1H-pyrro...)
Affinity DataIC50:  31nM. Assay description: Antagonistic activity of the compound was evaluated in terms of inhibition of Retinoic acid receptor alpha transactivation by ATRA (50 nM)
In DepthDetails ArticlePubMed
TargetRetinoic acid receptor beta(Homo sapiens (Human))
Eisai
Curated by ChEMBL
LigandPNGBDBM50099474(4-[5-(8-Isopropyl-4-phenyl-quinolin-2-yl)-1H-pyrro...)
Affinity DataIC50: >3.00E+3nM. Assay description: Antagonistic activity of the compound was evaluated in terms of inhibition of Retinoic acid receptor beta transactivation by ATRA (50 nM); Not detect...
In DepthDetails ArticlePubMed
TargetRetinoic acid receptor gamma(Homo sapiens (Human))
Eisai
Curated by ChEMBL
LigandPNGBDBM50099474(4-[5-(8-Isopropyl-4-phenyl-quinolin-2-yl)-1H-pyrro...)
Affinity DataIC50: >3.00E+3nM. Assay description: Antagonistic activity of the compound was evaluated in terms of inhibition of Retinoic acid receptor gamma transactivation by ATRA (50 nM); Not detec...
In DepthDetails ArticlePubMed