BDBM50100280 4-Imidazol-1-ylmethyl-2-phenethyloxy-benzonitrile::CHEMBL22454
SMILES N#Cc1ccc(Cn2ccnc2)cc1OCCc1ccccc1
InChI Key InChIKey=JVQYMSCCLBZQOV-UHFFFAOYSA-N
Data  2 IC50
  Tab Delimited (TSV)   2D SDfile   Computed 3D by Vconf -m prep SDfile
Find this compound or compounds like it in BindingDB:
Activity Spreadsheet -- Enzyme Inhibition Constant Data from BindingDB
Found 2 hits for monomerid = 50100280
TargetProtein farnesyltransferase subunit beta/geranylgeranyltransferase type-1 subunit alpha(Homo sapiens (Human))
Merck Research Laboratories
Curated by ChEMBL
LigandPNGBDBM50100280(4-Imidazol-1-ylmethyl-2-phenethyloxy-benzonitrile ...)
Affinity DataIC50:  860nM. Assay description: Inhibition of rate of incorporation of [3H]-FPP into recombinant Ras-CVIM by human farnesyltransferase.
In DepthDetails ArticlePubMed
LigandPNGBDBM50100280(4-Imidazol-1-ylmethyl-2-phenethyloxy-benzonitrile ...)
Affinity DataIC50:  7.00E+3nM. Assay description: Displacement of radiolabeled FTI from Farnesyltransferase in cultured v-Ha-ras-transformed RAT1 cells
In DepthDetails ArticlePubMed