BDBM50100924 CHEMBL41408::N-Hydroxy-N-[1-(4'-methoxy-biphenyl-4-yloxymethyl)-2-(3,4,4-trimethyl-2,5-dioxo-imidazolidin-1-yl)-ethyl]-formamide
SMILES COc1ccc(cc1)-c1ccc(OCC(CN2C(=O)N(C)C(C)(C)C2=O)N(O)C=O)cc1
InChI Key InChIKey=NOJIQYLBNRETQN-UHFFFAOYSA-N
Data  2 IC50
  Tab Delimited (TSV)   2D SDfile   Computed 3D by Vconf -m prep SDfile
Find this compound or compounds like it in BindingDB:
Activity Spreadsheet -- Enzyme Inhibition Constant Data from BindingDB
Found 2 hits for monomerid = 50100924
Target72 kDa type IV collagenase(Homo sapiens (Human))
Abbott Laboratories
Curated by ChEMBL
LigandPNGBDBM50100924(CHEMBL41408 | N-Hydroxy-N-[1-(4'-methoxy-biphenyl-...)
Affinity DataIC50:  4nM. Assay description: In vitro inhibition of human Matrix metalloproteinase-2.
In DepthDetails ArticlePubMed
TargetInterstitial collagenase(Homo sapiens (Human))
Abbott Laboratories
Curated by ChEMBL
LigandPNGBDBM50100924(CHEMBL41408 | N-Hydroxy-N-[1-(4'-methoxy-biphenyl-...)
Affinity DataIC50:  440nM. Assay description: In vitro inhibition of human Matrix metalloproteinase-1.
In DepthDetails ArticlePubMed