BDBM50101606 CHEMBL80733::Trimethyl-(2-nonylcarbamoyloxy-3-phosphono-propyl)-ammonium
SMILES CCCCCCCCCNC(=O)OC(C[N+](C)(C)C)CP(O)([O-])=O
InChI Key InChIKey=SOWOAKRIRMZKBF-UHFFFAOYSA-N
Data  1 IC50
  Tab Delimited (TSV)   2D SDfile   Computed 3D by Vconf -m prep SDfile
Find this compound or compounds like it in BindingDB:
Activity Spreadsheet -- Enzyme Inhibition Constant Data from BindingDB
Found 1 hit for monomerid = 50101606
TargetCarnitine O-palmitoyltransferase 1, liver isoform(Rattus norvegicus)
Sigma Tau Pharmaceutical Industries
Curated by ChEMBL
LigandPNGBDBM50101606(CHEMBL80733 | Trimethyl-(2-nonylcarbamoyloxy-3-pho...)
Affinity DataIC50: >3.00E+5nM. Assay description: Inhibition of rat liver mitochondrial carnitine palmitoyltransferase 1 using [14C]-palmitoyl-CoA radioligand
In DepthDetails ArticlePubMed