BDBM50108731 1-{4-[4-(4-Hydroxymethyl-6-methyl-pyrimidin-2-yl)-3,5-dimethyl-piperazin-1-yl]-pyrimidin-2-yl}-ethanol::CHEMBL346682
SMILES C[C@@H](O)c1nccc(n1)N1C[C@H](C)N([C@H](C)C1)c1nc(C)cc(CO)n1
InChI Key InChIKey=DYKXXWMYNGRZFO-HZSPNIEDSA-N
Data  1 IC50
  Tab Delimited (TSV)   2D SDfile   Computed 3D by Vconf -m prep SDfile
Find this compound or compounds like it in BindingDB:
Activity Spreadsheet -- Enzyme Inhibition Constant Data from BindingDB
Found 1 hit for monomerid = 50108731
TargetSorbitol dehydrogenase(Homo sapiens (Human))
Pfizer
Curated by ChEMBL
LigandPNGBDBM50108731(1-{4-[4-(4-Hydroxymethyl-6-methyl-pyrimidin-2-yl)-...)
Affinity DataIC50:  130nM. Assay description: Concentration required for 50% in vitro inhibition of recombinant human sorbitol dehydrogenase (h-SDH)
In DepthDetails ArticlePubMed