BDBM50109525 CHEMBL3601861
SMILES COc1cc(ccc1Nc1nc(NCc2cccc(NC(=O)C=C)c2)c2cc[nH]c2n1)N1CCN(C)CC1
InChI Key InChIKey=SGUCMEZSHNACAP-UHFFFAOYSA-N
Data  1 IC50
  Tab Delimited (TSV)   2D SDfile   Computed 3D by Vconf -m prep SDfile
Find this compound or compounds like it in BindingDB:
Activity Spreadsheet -- Enzyme Inhibition Constant Data from BindingDB
Found 1 hit for monomerid = 50109525
TargetTyrosine-protein kinase JAK3(Homo sapiens (Human))
Harvard Medical School
Curated by ChEMBL
LigandPNGBDBM50109525(CHEMBL3601861)
Affinity DataIC50:  2.72E+3nM. Assay description: Inhibition of JAK3 (unknown origin) by Z'-Lyte assay
In DepthDetails ArticlePubMed