BDBM50109951 CHEMBL160396::{3-[4-(4-Chloro-phenyl)-piperazin-1-ylmethyl]-pyrazolo[1,5-a]pyridin-4-yl}-methanol
SMILES OCc1cccn2ncc(CN3CCN(CC3)c3ccc(Cl)cc3)c12
InChI Key InChIKey=AYTNWERJAAXIPL-UHFFFAOYSA-N
Data  5 KI
  Tab Delimited (TSV)   2D SDfile   Computed 3D by Vconf -m prep SDfile
Find this compound or compounds like it in BindingDB:
Activity Spreadsheet -- Enzyme Inhibition Constant Data from BindingDB
Found 5 hits for monomerid = 50109951
TargetD(4) dopamine receptor(Homo sapiens (Human))
Friedrich-Alexander University
Curated by ChEMBL
LigandPNGBDBM50109951(CHEMBL160396 | {3-[4-(4-Chloro-phenyl)-piperazin-1...)
Affinity DataKi:  110nM. Assay description: In vitro binding affinity at human cloned dopamine receptor D4 stably expressed in CHO cells by [3H]spiperone displacement.
In DepthDetails ArticlePubMed
TargetD(1A) dopamine receptor(BOVINE)
Friedrich-Alexander University
Curated by ChEMBL
LigandPNGBDBM50109951(CHEMBL160396 | {3-[4-(4-Chloro-phenyl)-piperazin-1...)
Affinity DataKi:  4.80E+3nM. Assay description: In vitro binding affinity at human cloned dopamine receptor D1 stably expressed in CHO cells by [3H]-SCH- 23390 displacement.
In DepthDetails ArticlePubMed
TargetD(2) dopamine receptor(Homo sapiens (Human))
Friedrich-Alexander University
Curated by ChEMBL
LigandPNGBDBM50109951(CHEMBL160396 | {3-[4-(4-Chloro-phenyl)-piperazin-1...)
Affinity DataKi:  5.60E+4nM. Assay description: In vitro binding affinity at human cloned dopamine receptor D2 (long) stably expressed in CHO cells by [3H]-Spiperone displacement.
In DepthDetails ArticlePubMed
TargetD(2) dopamine receptor(Homo sapiens (Human))
Friedrich-Alexander University
Curated by ChEMBL
LigandPNGBDBM50109951(CHEMBL160396 | {3-[4-(4-Chloro-phenyl)-piperazin-1...)
Affinity DataKi:  7.90E+4nM. Assay description: In vitro binding affinity at human cloned dopamine receptor D2 (short) stably expressed in CHO cells by [3H]spiperone displacement.
In DepthDetails ArticlePubMed
TargetD(3) dopamine receptor(Homo sapiens (Human))
Friedrich-Alexander University
Curated by ChEMBL
LigandPNGBDBM50109951(CHEMBL160396 | {3-[4-(4-Chloro-phenyl)-piperazin-1...)
Affinity DataKi: >1.00E+5nM. Assay description: In vitro binding affinity at human cloned dopamine receptor D3 stably expressed in CHO cells by [3H]spiperone displacement.
In DepthDetails ArticlePubMed