BDBM50111045 Azapeptide::CHEMBL216130
SMILES CCCN(NC(=O)[C@H]1CCCN1C(=O)[C@@H](NC(=O)[C@@H](NC(=O)[C@H](CC(O)=O)NC(=O)[C@H](CCC(O)=O)NC(=O)[C@@H](NC(=O)[C@H](CC(O)=O)NC(C)=O)[C@@H](C)O)C(C)C)C(C)C)C(=O)c1cc(cc(c1)[N+]([O-])=O)[N+]([O-])=O
InChI Key InChIKey=SDPKJSTYXVTUGF-CHBIXXAASA-N
Data  1 KI
  Tab Delimited (TSV)   2D SDfile   Computed 3D by Vconf -m prep SDfile
Find this compound or compounds like it in BindingDB:
Activity Spreadsheet -- Enzyme Inhibition Constant Data from BindingDB
Found 1 hit for monomerid = 50111045
TargetGenome polyprotein(Hepatitis C virus)
Schering-Plough Research Institute
Curated by ChEMBL
LigandPNGBDBM50111045(Azapeptide | CHEMBL216130)
Affinity DataKi: >1.00E+5nM. Assay description: Binding affinity against Hepatitis C virus NS3 protease
In DepthDetails ArticlePubMed