BDBM50111873 (R)-2-[Benzo[1,3]dioxol-5-ylmethyl-(4-methoxy-benzenesulfonyl)-amino]-N-hydroxy-3-(1-methyl-1H-imidazol-4-yl)-propionamide::CHEMBL21657
SMILES COc1ccc(cc1)S(=O)(=O)N(Cc1ccc2OCOc2c1)[C@H](Cc1cn(C)cn1)C(=O)NO
InChI Key InChIKey=BKCCBFLMXACMGW-LJQANCHMSA-N
Data  1 IC50
  Tab Delimited (TSV)   2D SDfile   Computed 3D by Vconf -m prep SDfile
Find this compound or compounds like it in BindingDB:
Activity Spreadsheet -- Enzyme Inhibition Constant Data from BindingDB
Found 1 hit for monomerid = 50111873
TargetBone morphogenetic protein 1(Homo sapiens (Human))
Roche Bioscience
Curated by ChEMBL
LigandPNGBDBM50111873((R)-2-[Benzo[1,3]dioxol-5-ylmethyl-(4-methoxy-benz...)
Affinity DataIC50:  50nM. Assay description: Inhibitory activity against Procollagen C-Proteinase (PCP)
In DepthDetails ArticlePubMed