BDBM50112814 1-{4-[3-(4-Fluoro-phenyl)-isoxazol-5-yl]-butyl}-4-(2-methoxy-phenyl)-piperazine; hydrochloride::CHEMBL544220
SMILES COc1ccccc1N1CCN(CCCCc2cc(no2)-c2ccc(F)cc2)CC1
InChI Key InChIKey=HIIUKDCXWBFGHZ-UHFFFAOYSA-N
Data  3 KI
  Tab Delimited (TSV)   2D SDfile   Computed 3D by Vconf -m prep SDfile
Find this compound or compounds like it in BindingDB:
Activity Spreadsheet -- Enzyme Inhibition Constant Data from BindingDB
Found 3 hits for monomerid = 50112814
TargetD(3) dopamine receptor(Homo sapiens (Human))
Institute Of Science And Technology
Curated by ChEMBL
LigandPNGBDBM50112814(1-{4-[3-(4-Fluoro-phenyl)-isoxazol-5-yl]-butyl}-4-...)
Affinity DataKi:  23nM. Assay description: Displacement of the radioligand [3H]YM-09151-2 from cloned human Dopamine receptor D3 expressed in CHO cells
In DepthDetails ArticlePubMed
TargetD(4) dopamine receptor(Homo sapiens (Human))
Institute Of Science And Technology
Curated by ChEMBL
LigandPNGBDBM50112814(1-{4-[3-(4-Fluoro-phenyl)-isoxazol-5-yl]-butyl}-4-...)
Affinity DataKi:  33nM. Assay description: Displacement of the radioligand [3H]spiperone from the cloned human dopamine receptor D4 expressed in CHO cells
In DepthDetails ArticlePubMed
TargetD(2) dopamine receptor(Homo sapiens (Human))
Institute Of Science And Technology
Curated by ChEMBL
LigandPNGBDBM50112814(1-{4-[3-(4-Fluoro-phenyl)-isoxazol-5-yl]-butyl}-4-...)
Affinity DataKi:  321nM. Assay description: Displacement of the radioligand [3H]spiperone from the cloned human Dopamine receptor D2 long expressed in CHO cells
In DepthDetails ArticlePubMed