BDBM50113400 4-[2-(3-Cyclopentyloxy-4-methoxy-phenyl)-2-(4-fluoro-phenyl)-ethyl]-pyridine::CHEMBL36077
SMILES COc1ccc(cc1OC1CCCC1)C(Cc1ccncc1)c1ccc(F)cc1
InChI Key InChIKey=VAXQFJNXCAANMH-UHFFFAOYSA-N
Data  1 IC50
  Tab Delimited (TSV)   2D SDfile   Computed 3D by Vconf -m prep SDfile
Find this compound or compounds like it in BindingDB:
Activity Spreadsheet -- Enzyme Inhibition Constant Data from BindingDB
Found 1 hit for monomerid = 50113400
TargetcAMP-specific 3',5'-cyclic phosphodiesterase 4A(Homo sapiens (Human))
Celltech R&D
Curated by ChEMBL
LigandPNGBDBM50113400(4-[2-(3-Cyclopentyloxy-4-methoxy-phenyl)-2-(4-fluo...)
Affinity DataIC50:  47nM. Assay description: Inhibition of human recombinant phosphodiesterase 4A
In DepthDetails ArticlePubMed