BDBM50114689 CHEMBL3609657
SMILES [H][C@@]12C[C@H](O)CCN1C(=O)c1cccc(NC(=O)Nc3cnccn3)c21
InChI Key InChIKey=PFDVIMSWMQLRQB-MFKMUULPSA-N
Data  1 IC50
  Tab Delimited (TSV)   2D SDfile   Computed 3D by Vconf -m prep SDfile
Find this compound or compounds like it in BindingDB:
Activity Spreadsheet -- Enzyme Inhibition Constant Data from BindingDB
Found 1 hit for monomerid = 50114689
TargetDual specificity tyrosine-phosphorylation-regulated kinase 1A(Homo sapiens (Human))
Cnrs Umr 7311
Curated by ChEMBL
LigandPNGBDBM50114689(CHEMBL3609657)
Affinity DataIC50: >1.00E+4nM. Assay description: Inhibition of human recombinant GST-tagged DYRK1A expressed in Escherichia coli
In DepthDetails ArticlePubMed