BDBM50120972 CHEMBL3623060
SMILES [H][C@@]12CCCN1C(=O)[C@H](Cc1ccccc1)NC(=O)[C@H](CSCCS(=O)(=O)CCSC[C@H](NC(=O)[C@H](Cc1ccccc1)NC(=O)[C@H](CCCNC(N)=N)NC(=O)[C@H](CS)NC(=O)[C@H](CCCNC(N)=N)NC2=O)C(N)=O)NC(C)=O
InChI Key InChIKey=RGYKXJBVDZWPLT-TZPCGENMSA-N
Data  1 EC50
  Tab Delimited (TSV)   2D SDfile   Computed 3D by Vconf -m prep SDfile
Find this compound or compounds like it in BindingDB:
Activity Spreadsheet -- Enzyme Inhibition Constant Data from BindingDB
Found 1 hit for monomerid = 50120972
TargetSolute carrier family 40 member 1(Homo sapiens (Human))
University Of California Los Angeles
Curated by ChEMBL
LigandPNGBDBM50120972(CHEMBL3623060)
Affinity DataEC50: >600nM. Assay description: Agonist activity at GFP-fused human FPN transfected in HEK293 cells assessed as protein degradation after 24 hrs by flow cytometric analysis
In DepthDetails ArticlePubMed