BDBM50128388 (S)-1-[4-(4-Methyl-benzo[b]thiophen-2-yl)-piperidin-1-yl]-3-(2-methyl-1H-indol-4-yloxy)-propan-2-ol::CHEMBL294880
SMILES Cc1cc2c(OC[C@@H](O)CN3CCC(CC3)c3cc4c(C)cccc4s3)cccc2[nH]1
InChI Key InChIKey=DLNKVXSFIONPEX-FQEVSTJZSA-N
Data  2 KI
  Tab Delimited (TSV)   2D SDfile   Computed 3D by Vconf -m prep SDfile
Find this compound or compounds like it in BindingDB:
Activity Spreadsheet -- Enzyme Inhibition Constant Data from BindingDB
Found 2 hits for monomerid = 50128388
Target5-hydroxytryptamine receptor 1A(Homo sapiens (Human))
Eli Lilly
Curated by ChEMBL
LigandPNGBDBM50128388((S)-1-[4-(4-Methyl-benzo[b]thiophen-2-yl)-piperidi...)
Affinity DataKi:  10nM. Assay description: Binding affinity was determined towards 5-hydroxytryptamine 1A receptor receptor using [3H]-8-OH-DPAT as radioligand
In DepthDetails ArticlePubMed
TargetSodium-dependent serotonin transporter(Rattus norvegicus (rat))
Eli Lilly
Curated by ChEMBL
LigandPNGBDBM50128388((S)-1-[4-(4-Methyl-benzo[b]thiophen-2-yl)-piperidi...)
Affinity DataKi:  17nM. Assay description: Binding affinity towards serotonin [5-HT] reuptake site labeled with [3H]-paroxetine as radioligand
In DepthDetails ArticlePubMed