BDBM50128497 ((2R,4S)-2,6-Dimethyl-4-p-tolylamino-3,4-dihydro-2H-quinolin-1-yl)-(3-trifluoromethyl-phenyl)-methanone::CHEMBL294270
SMILES C[C@@H]1C[C@H](Nc2ccc(C)cc2)c2cc(C)ccc2N1C(=O)c1cccc(c1)C(F)(F)F
InChI Key InChIKey=GEQRNVLJQABVRV-JPYJTQIMSA-N
Data  1 EC50
  Tab Delimited (TSV)   2D SDfile   Computed 3D by Vconf -m prep SDfile
Find this compound or compounds like it in BindingDB:
Activity Spreadsheet -- Enzyme Inhibition Constant Data from BindingDB
Found 1 hit for monomerid = 50128497
TargetEcdysone receptor(Aedes aegypti)
Rheogene
Curated by ChEMBL
LigandPNGBDBM50128497(((2R,4S)-2,6-Dimethyl-4-p-tolylamino-3,4-dihydro-2...)
Affinity DataEC50:  1.84E+3nM. Assay description: Effective concentration for ecdysone-dependent transactivation in mammalian cell line expressing Aedes aegypti ecdysone receptor
In DepthDetails ArticlePubMed