BDBM50128669 1-(4-Bromo-benzyl)-4-(4-methoxy-benzenesulfonyl)-piperidine-4-carboxylic acid hydroxyamide::1-(4-bromobenzyl)-N-hydroxy-4-(4-methoxyphenylsulfonyl)piperidine-4-carboxamide::4-(4-but-2-ynyloxyphenylsulfanyl)piperidine-4-carboxylic acid hydroxyamide::CHEMBL78255
SMILES COc1ccc(cc1)S(=O)(=O)C1(CCN(Cc2ccc(Br)cc2)CC1)C(=O)NO
InChI Key InChIKey=YMQWZRPLMNNHEU-UHFFFAOYSA-N
Data  7 IC50
  Tab Delimited (TSV)   2D SDfile   Computed 3D by Vconf -m prep SDfile
Find this compound or compounds like it in BindingDB:
Activity Spreadsheet -- Enzyme Inhibition Constant Data from BindingDB
Found 7 hits for monomerid = 50128669
TargetMatrix metalloproteinase-9(Homo sapiens (Human))
Wyeth Research
Curated by ChEMBL
LigandPNGBDBM50128669(1-(4-Bromo-benzyl)-4-(4-methoxy-benzenesulfonyl)-p...)
Affinity DataIC50:  10nM. Assay description: Inhibition of MMP9
In DepthDetails ArticlePubMed
TargetCollagenase 3(Homo sapiens (Human))
Wyeth Research
Curated by ChEMBL
LigandPNGBDBM50128669(1-(4-Bromo-benzyl)-4-(4-methoxy-benzenesulfonyl)-p...)
Affinity DataIC50:  2nM. Assay description: Inhibition of MMP13
In DepthDetails ArticlePubMed
TargetDisintegrin and metalloproteinase domain-containing protein 17(Homo sapiens (Human))
Wyeth Research
Curated by ChEMBL
LigandPNGBDBM50128669(1-(4-Bromo-benzyl)-4-(4-methoxy-benzenesulfonyl)-p...)
Affinity DataIC50:  72nM. Assay description: Inhibition of TACE
In DepthDetails ArticlePubMed
TargetMatrix metalloproteinase-9(Homo sapiens (Human))
Wyeth Research
Curated by ChEMBL
LigandPNGBDBM50128669(1-(4-Bromo-benzyl)-4-(4-methoxy-benzenesulfonyl)-p...)
Affinity DataIC50:  10nM. Assay description: In vitro inhibitory activity against matrix metalloprotease-9.
In DepthDetails ArticlePubMed
TargetInterstitial collagenase(Homo sapiens (Human))
Wyeth Research
Curated by ChEMBL
LigandPNGBDBM50128669(1-(4-Bromo-benzyl)-4-(4-methoxy-benzenesulfonyl)-p...)
Affinity DataIC50:  598nM. Assay description: In vitro inhibitory activity against matrix metalloprotease-1
In DepthDetails ArticlePubMed
TargetCollagenase 3(Homo sapiens (Human))
Wyeth Research
Curated by ChEMBL
LigandPNGBDBM50128669(1-(4-Bromo-benzyl)-4-(4-methoxy-benzenesulfonyl)-p...)
Affinity DataIC50:  2nM. Assay description: In vitro inhibitory activity against matrix metalloprotease-13.
In DepthDetails ArticlePubMed
TargetInterstitial collagenase(Homo sapiens (Human))
Wyeth Research
Curated by ChEMBL
LigandPNGBDBM50128669(1-(4-Bromo-benzyl)-4-(4-methoxy-benzenesulfonyl)-p...)
Affinity DataIC50:  598nM. Assay description: Inhibition of MMP1
In DepthDetails ArticlePubMed