BDBM50130515 (3aS,5S,6aS)-5-Amino-4,5,6,6a-tetrahydro-3aH-cyclopenta[d]isoxazole-3,5-dicarboxylic acid::5-Amino-hexahydro-cyclopenta[d]isoxazole-3,5-dicarboxylic acid::CHEMBL322887
SMILES N[C@@]1(C[C@@H]2ON=C([C@@H]2C1)C(O)=O)C(O)=O
InChI Key InChIKey=NTVFQKSMRLANLZ-ZPLJKJSBSA-N
Data  6 KI  5 EC50
  Tab Delimited (TSV)   2D SDfile   Computed 3D by Vconf -m prep SDfile
Find this compound or compounds like it in BindingDB:
Activity Spreadsheet -- Enzyme Inhibition Constant Data from BindingDB
Found 11 hits for monomerid = 50130515
TargetMetabotropic glutamate receptor 1(RAT)
Università
Curated by ChEMBL
LigandPNGBDBM50130515((3aS,5S,6aS)-5-Amino-4,5,6,6a-tetrahydro-3aH-cyclo...)
Affinity DataKi:  2.70E+4nM. Assay description: Inhibitory constant of the compound against cloned rat Metabotropic glutamate receptor 1 expressed in Chinese Hamster Ovary (CHO) cells
In DepthDetails ArticlePubMed
TargetMetabotropic glutamate receptor 5(Rattus norvegicus (Rat))
Università
Curated by ChEMBL
LigandPNGBDBM50130515((3aS,5S,6aS)-5-Amino-4,5,6,6a-tetrahydro-3aH-cyclo...)
Affinity DataKi:  4.40E+5nM. Assay description: Inhibitory constant of the compound against cloned rat Metabotropic glutamate receptor 5 expressed in Chinese Hamster Ovary (CHO) cells
In DepthDetails ArticlePubMed
TargetMetabotropic glutamate receptor 2(Homo sapiens (Human))
Università
Curated by ChEMBL
LigandPNGBDBM50130515((3aS,5S,6aS)-5-Amino-4,5,6,6a-tetrahydro-3aH-cyclo...)
Affinity DataKi: >1.00E+6nM. Assay description: Binding affinity for mGluR2 receptor expressed in CHO cells
In DepthDetails ArticlePubMed
TargetMetabotropic glutamate receptor 4(Rattus norvegicus (Rat))
Università
Curated by ChEMBL
LigandPNGBDBM50130515((3aS,5S,6aS)-5-Amino-4,5,6,6a-tetrahydro-3aH-cyclo...)
Affinity DataKi: >1.00E+6nM. Assay description: Inhibitory constant of the compound against cloned rat Metabotropic glutamate receptor 4 expressed in Chinese Hamster Ovary (CHO) cells
In DepthDetails ArticlePubMed
TargetMetabotropic glutamate receptor 1(RAT)
Università
Curated by ChEMBL
LigandPNGBDBM50130515((3aS,5S,6aS)-5-Amino-4,5,6,6a-tetrahydro-3aH-cyclo...)
Affinity DataKi: >1.00E+6nM. Assay description: Binding affinity for mGluR1 receptor expressed in CHO cells
In DepthDetails ArticlePubMed
TargetMetabotropic glutamate receptor 4(Rattus norvegicus (Rat))
Università
Curated by ChEMBL
LigandPNGBDBM50130515((3aS,5S,6aS)-5-Amino-4,5,6,6a-tetrahydro-3aH-cyclo...)
Affinity DataKi: >1.00E+6nM. Assay description: Binding affinity for mGluR4 receptor expressed in CHO cells
In DepthDetails ArticlePubMed
TargetMetabotropic glutamate receptor 2(Homo sapiens (Human))
Università
Curated by ChEMBL
LigandPNGBDBM50130515((3aS,5S,6aS)-5-Amino-4,5,6,6a-tetrahydro-3aH-cyclo...)
Affinity DataEC50: >1.00E+6nM. Assay description: Effective concentration against mGluR2 receptor expressed in CHO cells
In DepthDetails ArticlePubMed
TargetMetabotropic glutamate receptor 1(RAT)
Università
Curated by ChEMBL
LigandPNGBDBM50130515((3aS,5S,6aS)-5-Amino-4,5,6,6a-tetrahydro-3aH-cyclo...)
Affinity DataEC50: >1.00E+6nM. Assay description: Effective concentration against mGluR1 receptor expressed in CHO cells
In DepthDetails ArticlePubMed
TargetMetabotropic glutamate receptor 2(Homo sapiens (Human))
Università
Curated by ChEMBL
LigandPNGBDBM50130515((3aS,5S,6aS)-5-Amino-4,5,6,6a-tetrahydro-3aH-cyclo...)
Affinity DataEC50:  1.60E+4nM. Assay description: Activity of the compound tested at cloned rat mGluR2 receptor expressed in Chinese Hamster Ovary (CHO) cells
In DepthDetails ArticlePubMed
TargetMetabotropic glutamate receptor 4(Rattus norvegicus (Rat))
Università
Curated by ChEMBL
LigandPNGBDBM50130515((3aS,5S,6aS)-5-Amino-4,5,6,6a-tetrahydro-3aH-cyclo...)
Affinity DataEC50: >1.00E+6nM. Assay description: Activity of the compound tested at cloned rat Metabotropic glutamate receptor 4 expressed in Chinese Hamster Ovary (CHO) cells
In DepthDetails ArticlePubMed
TargetMetabotropic glutamate receptor 4(Rattus norvegicus (Rat))
Università
Curated by ChEMBL
LigandPNGBDBM50130515((3aS,5S,6aS)-5-Amino-4,5,6,6a-tetrahydro-3aH-cyclo...)
Affinity DataEC50: >1.00E+6nM. Assay description: Effective concentration against mGluR4 receptor expressed in CHO cells
In DepthDetails ArticlePubMed