BDBM50132112 1-Phenyl-4-(1,3,4,9-tetrahydro-beta-carbolin-2-yl)-butan-1-one::CHEMBL129163
SMILES O=C(CCCN1CCc2c(C1)[nH]c1ccccc21)c1ccccc1
InChI Key InChIKey=SJUGUCWHNWWFDF-UHFFFAOYSA-N
Data  3 KI
  Tab Delimited (TSV)   2D SDfile   Computed 3D by Vconf -m prep SDfile
Find this compound or compounds like it in BindingDB:
Activity Spreadsheet -- Enzyme Inhibition Constant Data from BindingDB
Found 3 hits for monomerid = 50132112
Target5-hydroxytryptamine receptor 2A(Rattus norvegicus (rat))
Virginia Commonwealth University
Curated by ChEMBL
LigandPNGBDBM50132112(1-Phenyl-4-(1,3,4,9-tetrahydro-beta-carbolin-2-yl)...)
Affinity DataKi:  16nM. Assay description: Binding affinity towards rat 5-hydroxytryptamine 2A receptor expressed in NIH3T3 cells using [3H]ketanserin as radioligand
In DepthDetails ArticlePubMed
Target5-hydroxytryptamine receptor 2C(Rattus norvegicus (Rat))
Virginia Commonwealth University
Curated by ChEMBL
LigandPNGBDBM50132112(1-Phenyl-4-(1,3,4,9-tetrahydro-beta-carbolin-2-yl)...)
Affinity DataKi:  115nM. Assay description: Binding affinity towards rat 5-hydroxytryptamine 2C receptor expressed in A-9 cells using [3H]mesulergine as radioligand
In DepthDetails ArticlePubMed
Target5-hydroxytryptamine receptor 5A(MOUSE)
Virginia Commonwealth University
Curated by ChEMBL
LigandPNGBDBM50132112(1-Phenyl-4-(1,3,4,9-tetrahydro-beta-carbolin-2-yl)...)
Affinity DataKi:  550nM. Assay description: Binding affinity towards mouse 5-hydroxytryptamine 5A receptor using LSD as radioligand
In DepthDetails ArticlePubMed