BDBM50132477 CHEMBL3632716::US9751873, Example 127
SMILES C[C@H]1CC[C@H](c2ccccc2)S(=O)(=O)N1Cc1cc(F)c(cc1F)C(CO)CC1COC1
InChI Key InChIKey=ILKCLQBCDOSHSH-JZZRBVRFSA-N
Data  3 IC50
  Tab Delimited (TSV)   2D SDfile   Computed 3D by Vconf -m prep SDfile
Find this compound or compounds like it in BindingDB:
Activity Spreadsheet -- Enzyme Inhibition Constant Data from BindingDB
Found 3 hits for monomerid = 50132477
TargetNuclear receptor ROR-gamma(Homo sapiens (Human))
Therachem Research Medilab (India)
Curated by ChEMBL
LigandPNGBDBM50132477(CHEMBL3632716 | US9751873, Example 127)
Affinity DataIC50:  4nM. Assay description: inhibitory concentration needed to to reduce the bovine GGTase-catalyzed incorporation of [3H]-FPP into a biotin-linked K-ras (B) decapeptide
In DepthDetails ArticlePubMed
TargetNuclear receptor ROR-gamma(Homo sapiens (Human))
Therachem Research Medilab (India)
Curated by ChEMBL
LigandPNGBDBM50132477(CHEMBL3632716 | US9751873, Example 127)
Affinity DataIC50:  7nM. Assay description: Assays were carried out in 16-microL reaction volumes in black 384 Plus F Proxiplates (Perkin-Elmer 6008269). All assay components except test ligand...
In DepthDetails US Patent
TargetNuclear receptor ROR-gamma(Homo sapiens (Human))
Therachem Research Medilab (India)
Curated by ChEMBL
LigandPNGBDBM50132477(CHEMBL3632716 | US9751873, Example 127)
Affinity DataIC50:  4nM. Assay description: Assays were carried out in 16-microL reaction volumes in black 384 Plus F Proxiplates (Perkin-Elmer 6008269). All assay components except test ligand...
In DepthDetails US Patent