BDBM50134114 (3aR,10S)-2-(2-Dimethylamino-ethyl)-10-(4-methoxy-phenyl)-3a,4,9,10-tetrahydro-2,9,10a-triaza-cyclopenta[b]fluorene-1,3-dione::CHEMBL141577
SMILES COc1ccc(cc1)[C@H]1c2[nH]c3ccccc3c2Cc2c(O)n(CCN(C)C)c(=O)n12
InChI Key InChIKey=FMZYCMWTQKFAGC-QFIPXVFZSA-N
Data  1 IC50
  Tab Delimited (TSV)   2D SDfile   Computed 3D by Vconf -m prep SDfile
Find this compound or compounds like it in BindingDB:
Activity Spreadsheet -- Enzyme Inhibition Constant Data from BindingDB
Found 1 hit for monomerid = 50134114
TargetcGMP-specific 3',5'-cyclic phosphodiesterase(Bos taurus)
Glaxosmithkline
Curated by ChEMBL
LigandPNGBDBM50134114((3aR,10S)-2-(2-Dimethylamino-ethyl)-10-(4-methoxy-...)
Affinity DataIC50:  30nM. Assay description: Inhibitory activity against bovine PDE5 (phosphodiesterase-5).
In DepthDetails ArticlePubMed