BDBM50137851 CHEMBL3752866
SMILES Fc1ccc(cc1)-c1nn(cc1\C=N\OCc1ccc(Cl)cc1Cl)-c1ccccc1
InChI Key InChIKey=SHDGUODFSHEROS-UVHMKAGCSA-N
Data  2 IC50
  Tab Delimited (TSV)   2D SDfile   Computed 3D by Vconf -m prep SDfile
Find this compound or compounds like it in BindingDB:
Activity Spreadsheet -- Enzyme Inhibition Constant Data from BindingDB
Found 2 hits for monomerid = 50137851
TargetPhosphatidylinositol 4,5-bisphosphate 3-kinase catalytic subunit gamma isoform(Homo sapiens (Human))
Anhui Agricultural University
Curated by ChEMBL
LigandPNGBDBM50137851(CHEMBL3752866)
Affinity DataIC50:  1.26E+3nM. Assay description: Inhibition of PI3Kgamma (unknown origin) after 4 hrs
In DepthDetails ArticlePubMed
TargetPhosphatidylinositol 4,5-bisphosphate 3-kinase catalytic subunit gamma isoform(Mus musculus (Mouse))
Anhui Agricultural University
Curated by ChEMBL
LigandPNGBDBM50137851(CHEMBL3752866)
Affinity DataIC50:  7.22E+3nM. Assay description: Inhibition of PI3K-gamma in mouse lymph node cells assessed as inhibition of ConA-stimulated T cell proliferation
In DepthDetails ArticlePubMed