BDBM50139865 CHEMBL3764833::US10577361, E38
SMILES Cc1ncoc1-c1nnc(SCCCN2CCOC(C2)c2ccc(Br)cc2)n1C
InChI Key InChIKey=GIJMBCTXZDHLHI-UHFFFAOYSA-N
Data  5 KI
  Tab Delimited (TSV)   2D SDfile   Computed 3D by Vconf -m prep SDfile
Find this compound or compounds like it in BindingDB:
Activity Spreadsheet -- Enzyme Inhibition Constant Data from BindingDB
Found 5 hits for monomerid = 50139865
TargetD(3) dopamine receptor(Homo sapiens (Human))
Indivior
US Patent
LigandPNGBDBM50139865(CHEMBL3764833 | US10577361, E38)
Affinity DataKi:  191nM. Assay description: [3H]-Spiperone Binding Assay at hD3 and hD4 recombinant receptors CHO cells transiently transfected with human dopamine type 3 or 4 receptors (CHO-hD...
In DepthDetails US Patent
TargetD(3) dopamine receptor(Rattus norvegicus (Rat))
Aptuit
Curated by ChEMBL
LigandPNGBDBM50139865(CHEMBL3764833 | US10577361, E38)
Affinity DataKi:  200nM. Assay description: Displacement of [125I]-7-OH-PIPAT from rat brain dopamine D3 receptor after 45 mins by microplate scintillation counting analysis
In DepthDetails ArticlePubMed
TargetD(3) dopamine receptor(Homo sapiens (Human))
Indivior
US Patent
LigandPNGBDBM50139865(CHEMBL3764833 | US10577361, E38)
Affinity DataKi: <1.00E+4nM. Assay description: Agonist activity at human dopamine D3 receptor expressed in CHO cells after 90 mins by [35S]-GTPgamma S assay
In DepthDetails ArticlePubMed
TargetD(2) dopamine receptor(Homo sapiens (Human))
Indivior
US Patent
LigandPNGBDBM50139865(CHEMBL3764833 | US10577361, E38)
Affinity DataKi:  1.51E+4nM. Assay description: CHO cells stably expressing human dopamine receptor type 2, long variant (hD2L), coupled to Gα16 protein (CHO-Gα16-hD2L) were re-suspended ...
In DepthDetails US Patent
TargetD(2) dopamine receptor(Homo sapiens (Human))
Indivior
US Patent
LigandPNGBDBM50139865(CHEMBL3764833 | US10577361, E38)
Affinity DataKi:  1.58E+4nM. Assay description: Displacement of [125I]-7-OH-PIPAT from rat brain dopamine D2 receptor after 45 mins by microplate scintillation counting analysis
In DepthDetails ArticlePubMed