BDBM50144743 CHEMBL3764196
SMILES CC(C)c1c(O)c(O)c(C(O)=O)c2cc(c(C)cc12)-c1ccccc1C
InChI Key InChIKey=DAMBWURSQGQZJS-UHFFFAOYSA-N
Data  2 KI
  Tab Delimited (TSV)   2D SDfile   Computed 3D by Vconf -m prep SDfile
Find this compound or compounds like it in BindingDB:
Activity Spreadsheet -- Enzyme Inhibition Constant Data from BindingDB
Found 2 hits for monomerid = 50144743
TargetL-lactate dehydrogenase A chain(Homo sapiens (Human))
National Cancer Institute-Cro
Curated by ChEMBL
LigandPNGBDBM50144743(CHEMBL3764196)
Affinity DataKi:  3.00E+3nM. Assay description: Competitive inhibition of human LDH5 in presence of NADH
In DepthDetails ArticlePubMed
TargetL-lactate dehydrogenase B chain(Homo sapiens (Human))
National Cancer Institute-Cro
Curated by ChEMBL
LigandPNGBDBM50144743(CHEMBL3764196)
Affinity DataKi: >1.25E+5nM. Assay description: Competitive inhibition of human LDH1 in presence of NADH
In DepthDetails ArticlePubMed