BDBM50145930 CHEMBL3763340
SMILES CN1CCCN(Cc2ccc(cc2)-c2ccccc2)CC1
InChI Key InChIKey=IIMLRXWOOMSOGC-UHFFFAOYSA-N
Data  1 IC50  1 Kd
  Tab Delimited (TSV)   2D SDfile   Computed 3D by Vconf -m prep SDfile
Find this compound or compounds like it in BindingDB:
Activity Spreadsheet -- Enzyme Inhibition Constant Data from BindingDB
Found 2 hits for monomerid = 50145930
TargetCholine kinase alpha(Homo sapiens (Human))
Ariad Pharmaceuticals
Curated by ChEMBL
LigandPNGBDBM50145930(CHEMBL3763340)
Affinity DataKd:  3.70E+3nM. Assay description: Binding affinity to human N-terminal truncated ChoKalpha1 (75 to 457 residues) by surface plasmon resonance assay
In DepthDetails ArticlePubMed
TargetCholine kinase alpha(Homo sapiens (Human))
Ariad Pharmaceuticals
Curated by ChEMBL
LigandPNGBDBM50145930(CHEMBL3763340)
Affinity DataIC50:  1.48E+3nM. Assay description: Inhibition of human N-terminal truncated ChoKalpha1 (75 to 457 residues) using choline chloride as substrate measured over 10 to 30 mins by coupled A...
In DepthDetails ArticlePubMed