BDBM50147292 4-Isopropyl-3-methyl-5-oxo-5H-isoxazole-2-carboxylic acid carbamoylmethyl-methyl-amide::CHEMBL109163::N-(2-amino-2-oxoethyl)-4-isopropyl-N,3-dimethyl-5-oxoisoxazole-2(5H)-carboxamide
SMILES CC(C)c1c(C)n(oc1=O)C(=O)N(C)CC(N)=O
InChI Key InChIKey=BKBIOZMPPUYSAD-UHFFFAOYSA-N
Data  2 IC50
  Tab Delimited (TSV)   2D SDfile   Computed 3D by Vconf -m prep SDfile
Find this compound or compounds like it in BindingDB:
Activity Spreadsheet -- Enzyme Inhibition Constant Data from BindingDB
Found 2 hits for monomerid = 50147292
TargetHormone-sensitive lipase(Rattus norvegicus (Rat))
University Of Jordan
Curated by ChEMBL
LigandPNGBDBM50147292(4-Isopropyl-3-methyl-5-oxo-5H-isoxazole-2-carboxyl...)
Affinity DataIC50: >1.00E+3nM. Assay description: Inhibition of HSL in Wistar rat isolated fat cells by spectrophotometric assay
In DepthDetails ArticlePubMed
TargetHormone-sensitive lipase(Homo sapiens (Human))
Bayer Research Center
Curated by ChEMBL
LigandPNGBDBM50147292(4-Isopropyl-3-methyl-5-oxo-5H-isoxazole-2-carboxyl...)
Affinity DataIC50: >1.00E+3nM. Assay description: Inhibition of human recombinant hormone sensitive lipase (HSL)
In DepthDetails ArticlePubMed