BDBM50147308 4-Isopropyl-3-methyl-5-oxo-5H-isoxazole-2-carboxylic acid phenylamide::4-isopropyl-3-methyl-5-oxo-N-phenylisoxazole-2(5H)-carboxamide::CHEMBL105888
SMILES CC(C)c1c(C)n(oc1=O)C(=O)Nc1ccccc1
InChI Key InChIKey=YUAMRUGGYORQMM-UHFFFAOYSA-N
Data  2 IC50
  Tab Delimited (TSV)   2D SDfile   Computed 3D by Vconf -m prep SDfile
Find this compound or compounds like it in BindingDB:
Activity Spreadsheet -- Enzyme Inhibition Constant Data from BindingDB
Found 2 hits for monomerid = 50147308
TargetHormone-sensitive lipase(Rattus norvegicus (Rat))
University Of Jordan
Curated by ChEMBL
LigandPNGBDBM50147308(4-Isopropyl-3-methyl-5-oxo-5H-isoxazole-2-carboxyl...)
Affinity DataIC50: >1.00E+3nM. Assay description: Inhibition of HSL in Wistar rat isolated fat cells by spectrophotometric assay
In DepthDetails ArticlePubMed
TargetHormone-sensitive lipase(Homo sapiens (Human))
Bayer Research Center
Curated by ChEMBL
LigandPNGBDBM50147308(4-Isopropyl-3-methyl-5-oxo-5H-isoxazole-2-carboxyl...)
Affinity DataIC50: >1.00E+3nM. Assay description: Inhibition of human recombinant hormone sensitive lipase (HSL)
In DepthDetails ArticlePubMed