BDBM50148106 2-Ethyl-7-{3-[4-(4-fluoro-phenoxy)-2-propyl-phenoxy]-propoxy}-chroman-2-carboxylic acid::CHEMBL111271
SMILES CCCc1cc(Oc2ccc(F)cc2)ccc1OCCCOc1ccc2CCC(CC)(Oc2c1)C(O)=O
InChI Key InChIKey=BGISIBTWPYOJAU-UHFFFAOYSA-N
Data  2 IC50  2 EC50
  Tab Delimited (TSV)   2D SDfile   Computed 3D by Vconf -m prep SDfile
Find this compound or compounds like it in BindingDB:
Activity Spreadsheet -- Enzyme Inhibition Constant Data from BindingDB
Found 4 hits for monomerid = 50148106
TargetPeroxisome proliferator-activated receptor alpha(Homo sapiens (Human))
Merck Research Laboratories
Curated by ChEMBL
LigandPNGBDBM50148106(2-Ethyl-7-{3-[4-(4-fluoro-phenoxy)-2-propyl-phenox...)
Affinity DataEC50:  10nM. Assay description: In vitro potency of PPAR gene activation against human Peroxisome proliferator activated receptor alpha using chimeric Gal4-hPPAR transactivation ass...
In DepthDetails ArticlePubMed
TargetPeroxisome proliferator-activated receptor gamma(Homo sapiens (Human))
Merck Research Laboratories
Curated by ChEMBL
LigandPNGBDBM50148106(2-Ethyl-7-{3-[4-(4-fluoro-phenoxy)-2-propyl-phenox...)
Affinity DataEC50:  750nM. Assay description: In vitro potency of PPAR gene activation against human PPAR gamma receptor using chimeric Gal4-hPPAR transactivation assay (TA)
In DepthDetails ArticlePubMed
TargetPeroxisome proliferator-activated receptor alpha(Homo sapiens (Human))
Merck Research Laboratories
Curated by ChEMBL
LigandPNGBDBM50148106(2-Ethyl-7-{3-[4-(4-fluoro-phenoxy)-2-propyl-phenox...)
Affinity DataIC50:  970nM. Assay description: In vitro binding affinity for human peroxisome proliferator activated receptor alpha using scintillation proximity assay (SPA)
In DepthDetails ArticlePubMed
TargetPeroxisome proliferator-activated receptor gamma(Homo sapiens (Human))
Merck Research Laboratories
Curated by ChEMBL
LigandPNGBDBM50148106(2-Ethyl-7-{3-[4-(4-fluoro-phenoxy)-2-propyl-phenox...)
Affinity DataIC50:  1.20E+3nM. Assay description: In vitro binding affinity for human peroxisome proliferator activated receptor gamma using scintillation proximity assay (SPA)
In DepthDetails ArticlePubMed