BDBM50150485 CHEMBL556971::N-(5-Carbamimidoyl-1-cyclohexylcarbamoylmethyl-1H-benzoimidazol-2-ylmethyl)-N-[4-(4-carbamimidoyl-phenoxy)-phenyl]-terephthalamic acid; dihydrochloride
SMILES NC(=N)c1ccc(Oc2ccc(cc2)N(Cc2nc3cc(ccc3n2CC(=O)NC2CCCCC2)C(N)=N)C(=O)c2ccc(cc2)C(O)=O)cc1
InChI Key InChIKey=RHGCRRGHDOTVOW-UHFFFAOYSA-N
Data  2 IC50
  Tab Delimited (TSV)   2D SDfile   Computed 3D by Vconf -m prep SDfile
Find this compound or compounds like it in BindingDB:
Activity Spreadsheet -- Enzyme Inhibition Constant Data from BindingDB
Found 2 hits for monomerid = 50150485
TargetCoagulation factor X(Homo sapiens (Human))
Central Pharmaceutical Research Institute
Curated by ChEMBL
LigandPNGBDBM50150485(CHEMBL556971 | N-(5-Carbamimidoyl-1-cyclohexylcarb...)
Affinity DataIC50:  2.00E+3nM. Assay description: Inhibitory concentration against human Coagulation factor X
In DepthDetails ArticlePubMed
TargetProthrombin(Homo sapiens (Human))
Central Pharmaceutical Research Institute
Curated by ChEMBL
LigandPNGBDBM50150485(CHEMBL556971 | N-(5-Carbamimidoyl-1-cyclohexylcarb...)
Affinity DataIC50: >1.00E+4nM. Assay description: Inhibitory concentration against Coagulation factor II
In DepthDetails ArticlePubMed