BDBM50152647 CHEMBL363675::Thioacetic acid S-[(4S,5S)-2-(4-bromo-phenyl)-5-vinyl-4,5-dihydro-oxazol-4-yl] ester
SMILES CC(=O)S[C@@H]1N=C(O[C@H]1C=C)c1ccc(Br)cc1
InChI Key InChIKey=ASAPWKWJXIHFER-AAEUAGOBSA-N
Data  2 KI
  Tab Delimited (TSV)   2D SDfile   Computed 3D by Vconf -m prep SDfile
Find this compound or compounds like it in BindingDB:
Activity Spreadsheet -- Enzyme Inhibition Constant Data from BindingDB
Found 2 hits for monomerid = 50152647
TargetMatrix metalloproteinase-9(Homo sapiens (Human))
North Dakota State University
Curated by ChEMBL
LigandPNGBDBM50152647(CHEMBL363675 | Thioacetic acid S-[(4S,5S)-2-(4-bro...)
Affinity DataKi:  8.80E+4nM. Assay description: Inhibitory activity against matrix metalloprotease-9
In DepthDetails ArticlePubMed
TargetInterstitial collagenase(Homo sapiens (Human))
North Dakota State University
Curated by ChEMBL
LigandPNGBDBM50152647(CHEMBL363675 | Thioacetic acid S-[(4S,5S)-2-(4-bro...)
Affinity DataKi: >2.00E+5nM. Assay description: Inhibitory activity against matrix metalloprotease-1
In DepthDetails ArticlePubMed