BDBM50153180 CHEMBL3775782
SMILES NC(=O)c1ccnc(c1)-c1csc(N)n1
InChI Key InChIKey=YCMAFYWOEDTAQB-UHFFFAOYSA-N
Data  4 IC50
PDB links: 1 PDB ID matches this monomer.
  Tab Delimited (TSV)   2D SDfile   Computed 3D by Vconf -m prep SDfile
Find this compound or compounds like it in BindingDB:
Activity Spreadsheet -- Enzyme Inhibition Constant Data from BindingDB
Found 4 hits for monomerid = 50153180
TargetLysine-specific demethylase 5B(Homo sapiens (Human))
The Institute Of Cancer Research
Curated by ChEMBL
LigandPNGBDBM50153180(CHEMBL3775782)
Affinity DataIC50:  2.20E+3nM. Assay description: Inhibition of KDM5B (unknown origin) using biotin-H3K4me3 as substrate preincubated for 15 mins followed by substrate addition measured after 20 mins...
In DepthDetails ArticlePubMed
TargetLysine-specific demethylase 5C(Homo sapiens (Human))
The Institute Of Cancer Research
Curated by ChEMBL
LigandPNGBDBM50153180(CHEMBL3775782)
Affinity DataIC50:  6.80E+3nM. Assay description: Inhibition of KDM5C (unknown origin) using biotin-H3K4me3 as substrate preincubated for 15 mins followed by substrate addition measured after 20 mins...
In DepthDetails ArticlePubMed
TargetLysine-specific demethylase 4A(Homo sapiens (Human))
The Institute Of Cancer Research
Curated by ChEMBL
LigandPNGBDBM50153180(CHEMBL3775782)
Affinity DataIC50:  1.04E+5nM. Assay description: Inhibition of human N-terminal His-tagged KDM4A (1 to 359 residues) expressed in Escherichia coli using biotin-H3K9me3 as substrate preincubated for ...
TargetLysine-specific demethylase 4B(Homo sapiens (Human))
The Institute Of Cancer Research
Curated by ChEMBL
LigandPNGBDBM50153180(CHEMBL3775782)
Affinity DataIC50:  3.27E+4nM. Assay description: Inhibition of recombinant human N-terminal GST-tagged KDM4B (1 to 500 residues) expressed in baculovirus infected sf9 cells using biotin-H3K9me3 as s...
In DepthDetails ArticlePubMed