BDBM50156299 CHEMBL3780762
SMILES C(C1CC1)c1nc(NC2CCOCC2)ncc1-c1ccnc(Nc2ccncc2)n1
InChI Key InChIKey=SXZBZPMFLLEZAN-UHFFFAOYSA-N
Data  3 IC50
  Tab Delimited (TSV)   2D SDfile   Computed 3D by Vconf -m prep SDfile
Find this compound or compounds like it in BindingDB:
Activity Spreadsheet -- Enzyme Inhibition Constant Data from BindingDB
Found 3 hits for monomerid = 50156299
TargetPhosphatidylinositol 4,5-bisphosphate 3-kinase catalytic subunit delta isoform(Homo sapiens (Human))
Novartis Institutes For Biomedical Research
Curated by ChEMBL
LigandPNGBDBM50156299(CHEMBL3780762)
Affinity DataIC50:  4.20E+3nM. Assay description: Inhibition of PI3Kdelta (unknown origin)
In DepthDetails ArticlePubMed
TargetPhosphatidylinositol 3-kinase catalytic subunit type 3(Homo sapiens (Human))
Novartis Institutes For Biomedical Research
Curated by ChEMBL
LigandPNGBDBM50156299(CHEMBL3780762)
Affinity DataIC50:  270nM. Assay description: Inhibition of VPS34 in human U2OS cells incubated for 2 hrs by GFP-FYVE reporter gene assay
In DepthDetails ArticlePubMed
TargetPhosphatidylinositol 3-kinase catalytic subunit type 3(Homo sapiens (Human))
Novartis Institutes For Biomedical Research
Curated by ChEMBL
LigandPNGBDBM50156299(CHEMBL3780762)
Affinity DataIC50:  240nM. Assay description: Inhibition of recombinant human VPS34 using L-alpha-phosphatidylinositol as substrate incubated for 10 mins by luminescence based ATP detection assay
In DepthDetails ArticlePubMed