BDBM50156362 CHEMBL3785983
SMILES Cl.Cl.O=C(Nc1ccc2nc([nH]c(=O)c2c1)N1CCNCC1)c1ccc(cc1)N1CCNCC1
InChI Key InChIKey=NKEYYJYOFWWGOH-UHFFFAOYSA-N
Data  1 IC50
  Tab Delimited (TSV)   2D SDfile   Computed 3D by Vconf -m prep SDfile
Find this compound or compounds like it in BindingDB:
Activity Spreadsheet -- Enzyme Inhibition Constant Data from BindingDB
Found 1 hit for monomerid = 50156362
TargetIntegrin alpha-IIb/beta-3(Homo sapiens (Human))
A.V. Bogatsky Physico-Chemical Institute Of The National Academy Of Sciences Of Ukraine
Curated by ChEMBL
LigandPNGBDBM50156362(CHEMBL3785983)
Affinity DataIC50:  20nM. Assay description: Inhibition of FITC-labelled fibrinogen binding to integrin alpha2b beta3 receptor in human platelet cells
In DepthDetails ArticlePubMed