BDBM50161337 N-[1-((S)-(S)-4-Benzoyl-6-(S)-oxo-hexahydro-pyrrolo[3,2-b]pyrrole-1-carbonyl)-3-methyl-butyl]-4-dimethylamino-benzamide
SMILES CC(C)C[C@H](NC(=O)c1ccc(cc1)N(C)C)C(=O)N1CCC2[C@H]1C(=O)CN2C(=O)c1ccccc1
InChI Key InChIKey=XVXGIBWJZKQFOS-MFXHTCIWSA-N
Data  4 KI
  Tab Delimited (TSV)   2D SDfile   Computed 3D by Vconf -m prep SDfile
Find this compound or compounds like it in BindingDB:
Activity Spreadsheet -- Enzyme Inhibition Constant Data from BindingDB
Found 4 hits for monomerid = 50161337
TargetCathepsin K(Homo sapiens (Human))
Amura Therapeutics
Curated by ChEMBL
LigandPNGBDBM50161337(N-[1-((S)-(S)-4-Benzoyl-6-(S)-oxo-hexahydro-pyrrol...)
Affinity DataKi:  5.5nM. Assay description: Binding affinity against human cathepsin K
In DepthDetails ArticlePubMed
TargetCruzipain(Trypanosoma cruzi)
Amura Therapeutics
Curated by ChEMBL
LigandPNGBDBM50161337(N-[1-((S)-(S)-4-Benzoyl-6-(S)-oxo-hexahydro-pyrrol...)
Affinity DataKi:  600nM. Assay description: Binding affinity against cruzaine
In DepthDetails ArticlePubMed
TargetCysteine proteinase B(Leishmania mexicana)
Amura Therapeutics
Curated by ChEMBL
LigandPNGBDBM50161337(N-[1-((S)-(S)-4-Benzoyl-6-(S)-oxo-hexahydro-pyrrol...)
Affinity DataKi:  1.17E+3nM. Assay description: Binding affinity against Leishmania mexicana cysteine peptidase B (CPB)
In DepthDetails ArticlePubMed
TargetCathepsin S(Homo sapiens (Human))
Amura Therapeutics
Curated by ChEMBL
LigandPNGBDBM50161337(N-[1-((S)-(S)-4-Benzoyl-6-(S)-oxo-hexahydro-pyrrol...)
Affinity DataKi: >3.00E+3nM. Assay description: Binding affinity against cathepsin S
In DepthDetails ArticlePubMed